logo
down
shadow

JetBrains Resharper 9 Ultimate Test Runner error: NUnit.Core.UnsupportedFrameworkException: Skipped loading assembly {My


JetBrains Resharper 9 Ultimate Test Runner error: NUnit.Core.UnsupportedFrameworkException: Skipped loading assembly {My

Content Index :

JetBrains Resharper 9 Ultimate Test Runner error: NUnit.Core.UnsupportedFrameworkException: Skipped loading assembly {My
Tag : development , By : 66.
Date : November 29 2020, 09:01 AM

I hope this helps . As Yousefi mentioned, this is fixed by updating to version 10 of ReSharper. I had the same issue and that resolved it.

Comments
No Comments Right Now !

Boards Message :
You Must Login Or Sign Up to Add Your Comments .

Share : facebook icon twitter icon

NUnit first test very slow with Entity Framework in Resharper test runner


Tag : visual-studio , By : 22.
Date : March 29 2020, 07:55 AM
wish helps you That is common behavior because the first test will have to compile "EF views" - this happens first time you use anything mapped in your model. The same compiled views are then cached and reused. It can be avoided but it requires you manually generate the code for views (by using EdmGen.exe) add that code to your project and compile together with your solution. You will have to do this each time you change anything in EDMX unless you make it as some pre-build action in your project (it will in turn slow your build).

Resharper 10 Ultimate Test Runner changes test directory


Tag : development , By : chudq7
Date : March 29 2020, 07:55 AM
this one helps. Do you use CurrentDirectory in tests? If so, please refer to NUnit 3.0 Breaking-Changes page:

Resharper 2016.1.2 NUnit.Core.UnsupportedFrameworkException with NUnit 3 test


Tag : development , By : Nick Pegg
Date : March 29 2020, 07:55 AM
will help you I have installed NUnit 3.2.1 from here I then configured Resharper to use a custom NUnit installation
Resharper -> options -> use specific custom NUnit -> {C:\Program Files (x86)\NUnit.org\nunit-console}

NUnit runner compilation failed error with ReSharper and NUNIT


Tag : visual-studio , By : user96271
Date : March 29 2020, 07:55 AM
wish help you to fix your issue This is a bug with the latest version ("2016.3") of Resharper. More details here... https://youtrack.jetbrains.com/issue/RSRP-462284 The issue occurs when you have multiple test assemblies.

Error: Exception NUnit.Core.UnsupportedFrameworkException in VSTS


Tag : visual-studio , By : Steve Jones
Date : March 29 2020, 07:55 AM
Related Posts Related QUESTIONS :
  • "Objects are not valid as a React child" Redux error when conditionally connecting a component?
  • Displacy results are not showing
  • Strapi / Graphql. What am i doing wrong?
  • How to add Search bar for django template?
  • lookup in presto using single column against a range in lookup table
  • How can you stop videos being stolen on website?
  • Can't code substitution happen in Hybrid Flow?
  • Removed widget remains on parent
  • setup saga middleware with redux-starter-kit's configureStore()
  • How to get cookies from response of scrapy splash
  • I need to do a firebase stream and not a Http Get
  • Unable to compile node-runtime
  • SQLSTATE[42S22]: Column not found: 1054 Unknown column '' in 'where clause'
  • How to extract only the number from a variable
  • disable linter in DAML studio
  • RxJS: How to set exhaustMap concurrent?
  • How to remove perforce (p4) on Ubuntu
  • How do they know mean and std, the input value of transforms.Normalize
  • Why this type is not an Interface?
  • SugarCRM Rest API set_relationship between Contacts and Documents
  • Jira dashboard organization
  • Web worker importScripts fails to place script variables in global scope
  • Always errors - The "path" argument must be one of type string, Buffer, or URL. Received type undefined
  • How to create an observable of a stream of infinite items
  • Not efficiently to use multi-Core CPU for training Doc2vec with gensim
  • webGL gl_Position value saving outside shaders
  • Is it okay for a resolver to have side effects besides resolving the type?
  • Move 32bit register into a 8 bit register
  • Is there a way to update, not overwrite, worker_env for a Dask YarnCluster within a script?
  • Lotus Notes Deployment
  • How Do I Add Active Directory To APIM Using Terraform?
  • How to get the old parameter values in Blazor OnParameterSet?
  • How to debug "ERROR: Could not reach the worker node."?
  • How chain indefinite amount of flatMap operators in Reactor?
  • extract dates and times from string in Redshift
  • How do I make a column of 3 cards match in height in bootstrapVue?
  • how to replace missing values from another column in PySpark?
  • only read last line of text file (C++ Builder)
  • Snakemake --forceall --dag results in mysterius Error: <stdin>: syntax error in line 1 near 'File' from Graphvis
  • How Can I Remove Demo Products From APIM Created With Terraform?
  • How to avoid cloning a big integer in rust
  • Break a row of words into word groups in Hive
  • How can I add a path variable to existing files in an Installshield project converted from MSI
  • Certain languages are not available in postman; is there a way to enable it?
  • Concatenation step of U-Net for unequal number of channels
  • HL Fabric - states, transactions but varied keys
  • How to handle "flood wait" errors when using telethon.sync?
  • Any way to make closure which takes a destructured array?
  • What is the Difference between @PeculiarVentures 's `webcrypto` and `node-webcrypto-ossl`?
  • DWG Sheet Combination failing on AutoDesk Forge
  • karate.log(args) on afterScenario hook is not embedded on surefire json file
  • How do I output latest distinct values of specific fields and all other colums?
  • Clarification on lit-element components and where to browse them
  • Will websockets over HTTP2 also be multiplexed in streams?
  • How to apply switch statement for multi columns in datatables
  • frobot framework - Usage outside testing
  • How do I build against the UCRT with mingw-w64?
  • How to use someClass.android.ts and someClass.ios.ts without errors
  • ADB Connection to Samsung smart tv
  • is there a way to 2 create multiple command files in cypress
  • shadow
    Privacy Policy - Terms - Contact Us © scrbit.com